{"text_format":"1","workbook":"xlsx","n_sheets":2,"sheets":["Réalisation","Données"],"not_rendered":{"charts":0,"images":0,"macros":1,"external_links":0,"defined_names":42,"comments":0,"pivot_tables":0},"unopened":[],"bounds":{"document_bytes":16777216,"sheet_cells":100000,"rows_first":2000,"rows_last":500,"rows_between":2000,"halvings":0,"cell_chars":16384,"cell_head_chars":4096},"cells_cut":0,"cells_raw":0,"read":"whole","date_system":"1900"}

{"sheet":"Réalisation","index":0,"n_rows":21,"n_cols":6,"rows_kept":21,"cut":false,"hidden":false,"merged":[[8,1,11,5],[20,1,30,1],[18,2,30,2],[15,3,30,3],[13,4,30,4],[2,1,3,1],[5,1,6,1],[0,3,0,5],[2,2,3,5],[5,2,6,5]]}
["Cycle ",3,"Domaine :  ","Les langages pour penser et communiquer"]
[null,null,null,{"$f":"IF(D1=Données!C3,Données!C4,IF(D1=Données!D3,Données!D4,\"\"))","v":"Langages"}]
[null,"Composante : ","Comprendre, s’exprimer en utilisant la langue française à l’oral et à l’écrit"]
[]
[null,null,null,{"$f":"IF(ISERROR(VLOOKUP(C3,Données!C5:D8,2,1)),\"D3\",VLOOKUP(C3,Données!C5:D8,2,0))","v":"D1C1"},{"$f":"CONCATENATE(D5,\"C\",B1)","v":"D1C1C3"}]
[null,"Élément signifiant :","S'exprimer à l'oral"]
[]
[null,"Compétence :",null,{"$f":"Compos","v":"D1C1C3"},{"$f":"IF(E5=Données!C10,MATCH(C6,D1C1C2,0),IF(E5=Données!D10,MATCH(C6,D1C3C2,0),IF(E5=Données!E10,MATCH(C6,D1C4C2,0),IF(E5=Données!F10,MATCH(C6,D1C1C3,0),IF(E5=Données!G10,MATCH(C6,D1C3C3,0),IF(E5=Données!H10,MATCH(C6,D1C4C3,0),IF(E5=Données!I10,MATCH(C6,D3C2,0),IF(E5=Données!J10,MATCH(C6,D3C3,0),\"\"))))))))","v":1},{"$f":"CONCATENATE(D8,\"E\",E8)","v":"D1C1C3E1"}]
[null,"1)  qu'il soit capable de présenter de façon ordonnée des informations et des explications, d’exprimer un point de vue personnel en le justifiant."]
[]
[]
[]
[null,{"$f":"LEFT(B9,1)","v":"1"},{"$f":"CONCATENATE(F8,\"P\",B13)","v":"D1C1C3E1P1"}]
[null,null,null,null,{"$f":"IF(ISERROR(VLOOKUP(C13,Données!C25:G98,2,0)),\"\",VLOOKUP(C13,Données!C25:G98,5,0))","v":"Etre capable d'apporter un soutien à ses camarades pour qu'ils transmettent une information, une explication"}]
[]
[null,null,null,{"$f":"IF(ISERROR(VLOOKUP(C13,Données!C25:G98,2,0)),\"\",VLOOKUP(C13,Données!C25:G98,4,0))","v":"Présenter de façon ordonnée des informations et des explications, d'exprimer un point de vue en le justifiant"}]
[]
[]
[null,null,{"$f":"IF(ISERROR(VLOOKUP(C13,Données!C25:G98,2,0)),\"\",VLOOKUP(C13,Données!C25:G98,3,0))","v":"Reformuler les informations, donner son point de vue, sans justifier"}]
[]
[null,{"$f":"IF(ISERROR(VLOOKUP(C13,Données!C25:G98,2,0)),\"\",VLOOKUP(C13,Données!C25:G98,2,0))","v":"Redire, relire les informations du texte, tel quel"}]

{"sheet":"Données","index":1,"n_rows":98,"n_cols":26,"rows_kept":98,"cut":false,"hidden":false,"merged":[]}
["Cycle",null,"Domaine"]
[]
[2,null,"Les langages pour penser et communiquer","La formation de la personne et du citoyen"]
[3,null,"Langages","Formation"]
[null,null,null," "]
[{"$f":"Réalisation!D2","v":"Langages"},null,"Comprendre, s’exprimer en utilisant la langue française à l’oral et à l’écrit","D1C1"]
[null,null,"Comprendre, s’exprimer en utilisant les langages mathématiques, scientifques et informatiques","D1C3"]
[null,null,"Comprendre, s’exprimer en utilisant les langages des arts et du corps","D1C4"]
[]
[{"$f":"Réalisation!E5","v":"D1C1C3"},null,"D1C1C2","D1C3C2","D1C4C2","D1C1C3","D1C3C3","D1C4C3","D3C2","D3C3"]
[null,null,"Comprendre et s'exprimer à l'oral","Utiliser les nombres entiers","Pratiquer et comprendre les langages artistiques","S'exprimer à l'oral","Utiliser les nombres entiers, les nombres décimaux et les fractions simples","Pratiquer les arts en mobilisant divers langages artistiques et leurs ressources expressives - Prendre du recul sur la pratique artistique individuelle et collective","S’exprimer (émotions, opinions, préférences) et respecter l’expression d’autrui","Maîtriser l’expression de sa sensibilité et de ses opinions, respecter celles des autres"," "]
[null,null,"Lire et comprendre l’écrit","Reconnaitre des solides usuels et des fgures géométriques"," ","Comprendre des énoncés oraux","Reconnaitre des solides usuels et des fgures géométriques",null,"Prendre en compte les règles communes","Comprendre la règle et le droit"," "]
[null,null,"Écrire","Se repérer et se déplacer"," ","Lire et comprendre l’écrit","Se repérer et se déplacer",null,"Manifester son appartenance à un collectif","Exercer son esprit critique, faire preuve de  réﬂexion et de discernement"," "]
[null,null,"Utiliser à bon escient les régularités qui organisent la langue française (dans la limite de celles qui ont été étudiées)"," ",null,"Écrire"]
[null,null,null,null,null,"Exploiter les ressources de la langue - Réﬂéchir sur le système linguistique"," "]
[]
[{"$f":"Réalisation!F8","v":"D1C1C3E1"},null,"D1C1C2E1","D1C1C2E2","D1C1C2E3","D1C1C2E4","D1C3C2E1","D1C3C2E2","D1C3C2E3","D1C4C2E1","D1C1C3E1","D1C1C3E2","D1C1C3E3","D1C1C3E4","D1C1C3E5","D1C3C3E1","D1C3C3E2","D1C3C3E3","D1C4C3E1","D3C2E1","D3C2E2","D3C2E3","D3C3E1","D3C3E2","D3C3E3"]
[null,null,"1)  Ecouter pour les comprendre des messages oraux ou des textes lus par un adulte.\n","1)  Identifier des mots rapidement : décoder aisément des mots inconnus réguliers, reconnaître des mots fréquents et des mots irréguliers mémorisés.","1)  Copier ou transcrire, dans une écriture lisible, un texte d’une dizaine de lignes.","1)  Orthographier les mots les plus fréquents notamment en situation scolaire) et les mots invariables mémorisés.","1) Comprendre et utiliser des nombres entiers pour dénombrer, ordonner, repérer, comparer.","1)  Reconnaitre, nommer, décrire, reproduire quelques solides.","1)  (Se) repérer et (se) déplacer en utilisant des repères et des représentations.","1) Mener à bien une production artistique dans le cadre d’un projet personnel ou collectif.","1)  qu'il soit capable de présenter de façon ordonnée des informations et des explications, d’exprimer un point de vue personnel en le justifiant.","1)  qu’il sache écouter en maintenant son attention un propos continu de cinq à dix minutes, une lecture à haute voix, une émission documentaire associant son et image d’une vingtaine de minutes.","1) qu’il maîtrise une lecture orale et silencieuse fluide.","1) qu’il écrive à la main de manière fluide et efficace et soit également capable d’écrire facilement avec le clavier d’un ordinateur.","1) qu’il sache transcrire un énoncé oral sans erreur phonologique, en maitrisant la segmentation des unités linguistiques et en utilisant une ponctuation adaptée. ","1) Utiliser et représenter les grands nombres entiers, des fractions simples, les nombres décimaux.","1) Reconnaitre, nommer, décrire, reproduire, représenter, construire des figures et solides usuels.","1) (Se) repérer et (se) déplacer dans l’espace en utilisant ou en élaborant des représentations.","1) Formuler ses émotions, argumenter une intention.","1) Exprimer et justifier un avis ou un point de vue personnel dans un échange où d’autres peuvent faire de même.","1) Se référer à des règles et adopter un comportement adéquat.","1) Contribuer à la vie collective et au bon déroulement des activités dans la classe et dans l’école en assumant des responsabilités.","1) Exprimer des émotions ressenties.","1) Identifier et connaitre les grands principes, les valeurs et les symboles de la République française.","1) Percevoir les enjeux d’ordre moral d’une situation réelle ou fictive"," "]
[null,null,"2)  Pratiquer avec efficacité trois formes de discours attendues : raconter, décrire, expliquer.","2)  Lire et comprendre en autonomie des textes inconnus adaptés à la maturité et à la culture scolaire d’élèves de 9 ans.","2)  Rédiger un texte d’environ une demi-page, cohérent, organisé, ponctué, pertinent par rapport à la visée et au destinataire.","2)  Raisonner pour réaliser les accords dans le groupe nominal d’une part déterminant, nom, adjectif), entre le verbe et son sujet d’autre part cas simples : sujet placé avant le verbe et proche de lui ; sujet composé d’un groupe nominal comportant au plus un adjectif).","2) Nommer, lire, écrire, représenter des nombres entiers.","2)  Reconnaitre, nommer, décrire, reproduire, construire quelques figures géométriques."," ","2) Mobiliser sa voix parlée et chantée au bénéfice d’une reproduction expressive.","2) qu’il sache raconter une histoire.","2)  qu’il puisse manifester sa compréhension d’un message oral, d’un propos, d’un texte lu, d’un discours, d’une émission, etc…","2) qu’il soit capable de lire en intégralité et de manière autonome un livre adapté à son âge.","2) qu’il recoure à l’écriture de manière autonome pour garder des traces de ses lectures, pour réfléchir et pour apprendre.","2) qu’il ait mémorisé l’orthographe des mots les plus fréquents ainsi que ceux qu’il a appris dans les différentes disciplines.","2) Calculer avec des nombres entiers et des nombres décimaux.","2) Reconnaitre et utiliser quelques relations géométriques (notions d’alignement, d’appartenance, de perpendicularité, de parallélisme, d’égalité de longueurs, d’égalité d’angle, de distance entre deux points, de symétrie, d’agrandissement et de réduction)."," ","2) Réaliser, donner à voir et à réfléchir sur des productions plastiques de natures diverses suivant une intention artistique.","2) Faire part de ses émotions dans des situations particulières."," ","2) Reconnaître des symboles de la République française.","2) Formuler une opinion, prendre de la distance avec celle-ci, la confronter à celle d’autrui et en discuter.","2) S’approprier et respecter les règles de fonctionnement de son école ou de son établissement et de collectifs plus restreints, et participer à leur élaboration.","2) Dépasser des clichés et des stéréotypes."," "]
[null,null,"3)  Participer avec pertinence en adoptant les règles usuelles de la conversation ; en restant dans le propos) à un échange : questionner, répondre à une interpellation, exprimer une position personnelle accord ou désaccord, avis, point de vue..), apporter un complément…","3)  Lire à voix haute avec fluidité, après préparation, un texte d’une demi-page."," "," ","3) Calculer avec des nombres entiers.","3)  Reconnaitre et utiliser les notions d’alignement, d’angle droit, d’égalité de longueurs, de milieu, de symétrie."," ","3) Mobiliser des moyens plastiques diversifiés au service d’une expression et d’une création artistiques.","3)  qu’il réalise une courte présentation orale après avoir élaboré un support papier, numérique, etc.) pour cette présentation."," ","3) qu’il recoure à la lecture de manière autonome pour chercher des informations, répondre à un problème, compléter une connaissance, vérifier une hypothèse ou un propos.","3) qu’il soit capable de formuler, à l’écrit, une réaction, un point de vue, une analyse, en réponse à une question.","3) qu’il soit capable, dans une situation de production écrite, ou sous la dictée, de réaliser les accords dans le groupe nominal, d’accorder le verbe et son sujet dans les cas simples définis par les attendus du programme ainsi que l’attribut avec le sujet.","3) Comparer, estimer, mesurer, calculer des grandeurs en utilisant des nombres entiers et des nombres décimaux : longueur (périmètre, distance), aire, volume, angle, vitesse, masse, coûts."," "," ","3) Dans un projet artistique, repérer les écarts entre l’intention de l’auteur, la production et l’interprétation par les spectateurs."," "," "," "," "," "," "]
[null,null,"4)  Dire de mémoire un texte devant un auditoire poème, courte scène…)"," ",null," ",null,null,null,"4) Mettre en œuvre les conditions d’une écoute attentive et précise.","4)  qu’il participe à un débat en prenant en compte la parole d’autrui."," ","4) qu’il mette en œuvre une démarche de compréhension et d’interprétation d’un texte littéraire ou d’un document (simple ou composite) en prenant appui sur différents indices signifiants, en mettant ces indices en relation, en prenant conscience des éléments implicites et en raisonnant à partir des informations données par le texte et de ses connaissances pour expliciter ce que le texte ou le document ne dit pas.","4) qu’il soit capable de réviser son propre texte à partir de consignes ou d’outils de travail.","4) qu’il sache réviser un énoncé produit par lui-même ou un autre scripteur à partir d’indications orientant cette révision. ","4) Exprimer une grandeur mesurée ou calculée dans une unité adaptée."," "," ","4) Identifier, choisir et mobiliser les techniques vocales et corporelles au service du sens et de l’expression."," "," "," "," "," "," "]
[null,null,null,null,null,null,null,null,null,"5) Observer et décrire les œuvres et les productions artistiques en utilisant quelques notions des langages artistiques.","5)  qu’il réutilise des mots, des formules, des expressions rencontrées dans des textes lus, des énoncés écrits et oraux."," ","5) qu’il propose de manière autonome sa compréhension d’un texte inconnu d’une vingtaine de lignes ou d’un document associant un énoncé écrit et un autre support (image ou schéma).","5) qu’il sache écrire de manière autonome un texte d’une à deux pages à la graphie lisible et en respectant les régularités orthographiques étudiées au cours du cycle.","5) qu’il sache raisonner pour trouver le sens de mots inconnus en prenant appui sur la morphologie, les réseaux de mots qu’il a appris à construire, et le contexte."," "," "," ","5) Explorer les sons de la voix et de son environnement, imaginer des utilisations musicales, créer des organisations dans le temps d’un ensemble de sons sélectionnés."," "," "," "," "," "," "]
[null,null,null,null,null,null,null,null,null,"6) Exprimer un avis ou une intention adossés à une sensibilité personnelle à propos d’une œuvre d’art, d’une interprétation vocale, d’une production plastique.","6)  qu’il puisse dire de mémoire un texte à haute voix."," ","6) qu’il formule une réaction (émotion, réflexion, intérêt, etc.) après avoir lu un texte ou un document, en prenant appui sur ses connaissances et son expérience personnelle.","6) que le texte produit soit rédigé dans une langue suffisamment maitrisée pour que son intelligibilité ne soit pas compromise. "," "," "," "," "," "," "," "," "," "," "," "]
[null,null,null,null,null,null,null,null,null,null,null,null,null,"7) que le lexique appris dans les différentes disciplines soit réinvesti à bon escient."," "]
[null,null,"D1C1C2E1P1","Ne pas être attentif et ne pas savoir écouter","Ecouter sans comprendre des messages ou écouter partiellement","Ecouter pour les comprendre des messages oraux ou des textes lus par un adulte","Reformuler ce qui a été dit ou lu par un adulte",null,null,null,null,null,null,"8) qu’il puisse participer à un projet d’écriture collectif."," "]
[null,null,"D1C1C2E1P2","Savoir décrire une image avec des mots ou des phrases","Savoir raconter une histoire et commencer à expliquer un choix","Pratiquer avec efficacité 3 formes de discours attendues raconter, décrire, expliquer","Combiner les 3 formes de discours attendues dans des situations variées"]
[null,null,"D1C1C2E1P3","Donner un propos hors sujet ou incohérent ","Répondre et questionner de façon cohérente en restant dans le sujet","Participer avec pertinence à un échange, questionner répondre à une interpellation, exprimer une position personnelle, apporter un complément","Argumenter avec pertinence et clarté, débattre en respectant les règles de communiction"]
[null,null,"D1C1C2E1P4","Ne pas mémoriser le texte et/ou ne pas être capable de réciter devant un auditoire","Dire de mémoire un texte ou une partie du texte devant un auditoire ou seulement devant l'enseignant  ","Dire de mémoire un texte devant un auditoire (poème,courte scène...)","Dire de mémoire un texte devant un auditoire en soignant l'intonation et la gestuelle, l'interprétrer (poème, courte scène…)"]
[null,null,"D1C1C2E2P1","L'élève arrive à décoder les sons simples et les mots outils avec une aide de l'enseignant","L'élève déchiffre des sons simples et reconnaît quelques mots simples de lui-même","Identifier les mots rapidement : décoder aisément des mots inconnus réguliers, reconnaître des mots fréquents et des mots irréguliers mémorisés","L'élève décode, reconnaît et maîtrise la fluence de tous les mots rencontrés  (automatisation des correspondances grapho-phonologiques)"]
[null,null,"D1C1C2E2P2","Déchiffrer un texte inconnu avec l'aide de l'adulte sans accéder au sens ","Déchiffrer seul un texte inconnu et le comprendre partiellement (lieux ou actions ou personnages)","Lire et comprendre en autonomie des textes inconnus adaptés à la maturité et à la culture scolaire d’élèves de 9 ans","Lire et comprendre en autonomie des textes inconnus en accédant à l'implicite (mobilisation des compétences linguistiques et culturelles)"]
[null,null,"D1C1C2E2P3","Lit de façon saccadée, syllabe par syllabe, sans fluidité","Lit à voix haute sans fluidité mot par mot","Lire à voix haute avec fluidité, après préparation, un texte d'une demi-page avec expression (intonation, ponctuation)","Lire à voix haute avec fluidité, sans préparation, un texte d'une demi-page avec expression (intonation, ponctuation)"]
[null,null,"D1C1C2E3P1","Copier ou transcrire des lettres puis des mots isolés simples dans une écriture lisible et sans erreurs","Copier ou transcire une phrarse dans une écriture lisible et sans erreurs","Copier ou transcrire dans une écriture lisible et sans erreurs un texte d'une dizaine de lignes ","Copier ou transcrire dans une écriture lisible, sans erreurs et fluide un texte de 10 lignes ou plus"]
[null,null,"D1C1C2E3P2","Dicter une phrase cohérente à l'adulte et repérer les différentes caractéristiques (ponctuation, sens, etc)","Dicter plusieurs phrases à l'adulte pour réaliser un texte en respectant les caractéristiques étudiées ","Rédiger un texte d'environ une demi-page, cohérent, organisé, ponctué, pertinent par rapport à la visée et le destinataire","Rédiger un texte d'environ une demi-page, cohérent, organisé, ponctué, pertinent par rapport à la visée et le destinataire en respectant les régularités orthographiques étudiées au long du cycle"]
[null,null,"D1C1C2E4P1","Ne pas connaître l'orthographe des mots les plus fréquents et des mots invariables","Orthographier un certain nombre de mots fréquents et de mots invariables (les plus simples)","Orthograhier les mots les plus fréquents et les mots invariables mémorisés","Connaître l'orthographe des mots les plus fréquents ainsi que ceux rencontrés dans les autres disciplines d'apprentissage et diverses productions écrites"]
[null,null,"D1C1C2E4P2","Ne pas connaître les accords dans le groupe nominal et dans le groupe verbal","Effectuer uniquement  les accords dans le groupe nominal ou dans le groupe verbal","Réaliser les accords dans le groupe nominal et dans le groupe verbal","Réaliser les accords dans le groupe nominal ; entre le verbe et son sujet lors des diverses productions écrites"]
[null,null,"D1C1C3E1P1","Redire, relire les informations du texte, tel quel","Reformuler les informations, donner son point de vue, sans justifier","Présenter de façon ordonnée des informations et des explications, d'exprimer un point de vue en le justifiant","Etre capable d'apporter un soutien à ses camarades pour qu'ils transmettent une information, une explication"]
[null,null,"D1C1C3E1P2","Formuler de manière incohérente ce qui a été perçu","Formuler les informations explicites de l'histoire : personnages principaux, lieux, moments","Savoir raconter une histoire (conserver le schéma narratif, chronologie du récit, percevoir les informations implicites)","Raconter une histoire et la placer dans un réseau litéraire ou documentaire"]
[null,null,"D1C1C3E1P3","Copier et lire les informations brutes (internet livre, documentaire…)","Réaliser une présentation orale mal structurée et peu cohérente","Réaliser une courte présentation orale après avoir élaboré un support pour cette présentation","Exposer sa présentation orale en prenant en compte les réactions de son auditoire, argumenter avec pertinence et clarté, débattre en respectant les règles de communiction"]
[null,null,"D1C1C3E1P4","Ne pas participer au débat","Participer au débat et exprimer son opinion sans tenir compte de ce qui vient d'être dit ou ne pas tenir compte du thème du débat","Participer à un débat en prenant en compte la parole d'autrui","Elargir le débat en le mettant en perspective, poser des questions, relancer le débat et/ou animer le débat"]
[null,null,"D1C1C3E1P5","Ne pas utiliser un vocabulaire précis, approprié","Connaitre des mots, des formules spécifiques mais ne pas les utiliser à bon escient","Réutiliser des mots, des formules,des expressions rencontrées dans des textes lus, des énoncés écrit et oraux","Réinventer les mots et formules spécifiques à un domaine dans une autre situation, dans un autre contexte"]
{"$rows_left_out":58}